BDBM421834 3-((4-hydroxy-1-(3-phenylbutanoyl)piperidin-4-yl)methyl)pyrido[3,2-d]pyrimidin-4(3H)-one::US10508098, Example I-13::US10513507, Example I-13::US10836741, Example I-13
SMILES CC(CC(=O)N1CCC(O)(Cn2cnc3cccnc3c2=O)CC1)c1ccccc1
InChI Key InChIKey=RXMQPCBMUDPRFS-UHFFFAOYSA-N
Data  3 IC50
  Tab Delimited (TSV)   2D SDfile   Computed 3D by Vconf -m prep SDfile
Find this compound or compounds like it in BindingDB:
Activity Spreadsheet -- Enzyme Inhibition Constant Data from BindingDB
Found 3 hits for monomerid = 421834
TargetUbiquitin carboxyl-terminal hydrolase 7(Homo sapiens (Human))
Forma Therapeutics
US Patent
LigandPNGBDBM421834(3-((4-hydroxy-1-(3-phenylbutanoyl)piperidin-4-yl)m...)
Affinity DataIC50:  600nM. Assay description: Each assay was performed in a final volume of 15 μL in assay buffer containing 20 mM Tris-HCl (pH 8.0, (1M Tris-HCl, pH 8.0 solution; Corning 46...
Ligand InfoPC cidPC sid
In DepthDetails US Patent
TargetUbiquitin carboxyl-terminal hydrolase 7 [208-1102](Homo sapiens (Human))
Valo Early Discovery
US Patent
LigandPNGBDBM421834(3-((4-hydroxy-1-(3-phenylbutanoyl)piperidin-4-yl)m...)
Affinity DataIC50:  600nM. Assay description: Each assay was performed in a final volume of 15 μL in assay buffer containing 20 mM Tris-HCl (pH 8.0, (1M Tris-HCl, pH 8.0 solution; Corning 46...
Ligand InfoPC cidPC sid
In DepthDetails US Patent
TargetUbiquitin carboxyl-terminal hydrolase 7(Homo sapiens (Human))
Forma Therapeutics
US Patent
LigandPNGBDBM421834(3-((4-hydroxy-1-(3-phenylbutanoyl)piperidin-4-yl)m...)
Affinity DataIC50:  600nM. Assay description: Each assay was performed in a final volume of 15 μL in assay buffer containing 20 mM Tris-HCl (pH 8.0, (1M Tris-HCl, pH 8.0 solution; Corning 46...
Ligand InfoPC cidPC sid
In DepthDetails US Patent