BDBM42228 1,2,3-Trimethyl-2-phenyl-2,3-dihydro-1H-benzoimidazole::1,2,3-trimethyl-2-phenyl-benzimidazole::1,2,3-trimethyl-2-phenylbenzimidazole::MLS000569045::SMR000175667::cid_799470
SMILES CN1c2ccccc2N(C)C1(C)c1ccccc1
InChI Key InChIKey=KRRQMNKTLOKWBN-UHFFFAOYSA-N
Data  6 IC50
  Tab Delimited (TSV)   2D SDfile   Computed 3D by Vconf -m prep SDfile
Find this compound or compounds like it in BindingDB:
Activity Spreadsheet -- Enzyme Inhibition Constant Data from BindingDB
Found 6 hits for monomerid = 42228
TargetTyrosine-protein phosphatase YopH(Yersinia enterocolitica)
University Of Pittsburgh
Curated by PubChem BioAssay
LigandPNGBDBM42228(1,2,3-Trimethyl-2-phenyl-2,3-dihydro-1H-benzoimida...)
Affinity DataIC50: >5.00E+4nM. Assay description: Yersinia pestis is the causal agent of the bubonic plague and, although modern antibiotics are extremely effective against the malady, the plague rem...
In DepthDetails PCBioAssay
TargetTyrosine-protein phosphatase YopH(Yersinia enterocolitica)
University Of Pittsburgh
Curated by PubChem BioAssay
LigandPNGBDBM42228(1,2,3-Trimethyl-2-phenyl-2,3-dihydro-1H-benzoimida...)
Affinity DataIC50:  4.43E+4nM. Assay description: Yersinia pestis is the causal agent of the bubonic plague and, although modern antibiotics are extremely effective against the malady, the plague rem...
In DepthDetails PCBioAssay
TargetNeutrophil cytosol factor 1 [S99G](Homo sapiens (Human))
Emory University
Curated by PubChem BioAssay
LigandPNGBDBM42228(1,2,3-Trimethyl-2-phenyl-2,3-dihydro-1H-benzoimida...)
Affinity DataIC50:  1.11E+4nM. Assay description: NIH Molecular Libraries Screening Centers Network [MLSCN] Emory Chemical Biology Discovery Center in MLSCN Assay provider: Susan Smith, Emory Univers...
In DepthDetails PCBioAssay
TargetEukaryotic translation initiation factor 4 gamma 1(Homo sapiens (Human))
Emory University
Curated by PubChem BioAssay
LigandPNGBDBM42228(1,2,3-Trimethyl-2-phenyl-2,3-dihydro-1H-benzoimida...)
Affinity DataIC50:  6.40E+4nM. Assay description: Dose Response Confirmation for Small Molecule Inhibitors of Eukaryotic Translation Initiation NIH Molecular Libraries Screening Centers Network [MLSC...
In DepthDetails PCBioAssay
TargetInduced myeloid leukemia cell differentiation protein Mcl-1(Homo sapiens (Human))
Emory University
Curated by PubChem BioAssay
LigandPNGBDBM42228(1,2,3-Trimethyl-2-phenyl-2,3-dihydro-1H-benzoimida...)
Affinity DataIC50:  4.95E+3nM. Assay description: NIH Molecular Libraries Screening Centers Network [MLSCN] Emory Chemical Biology Discovery Center in MLSCN Assay provider: Nikolovska-Coleska, Univer...
In DepthDetails PCBioAssay
TargetTyrosine-protein phosphatase YopH(Yersinia enterocolitica)
University Of Pittsburgh
Curated by PubChem BioAssay
LigandPNGBDBM42228(1,2,3-Trimethyl-2-phenyl-2,3-dihydro-1H-benzoimida...)
Affinity DataIC50: >5.00E+4nM. Assay description: Yersinia pestis is the causal agent of the bubonic plague and, although modern antibiotics are extremely effective against the malady, the plague rem...
In DepthDetails PCBioAssay