BDBM42255 MLS000391861::N-[3-[(1,1-diketothiolan-3-yl)-methyl-amino]-1,4-diketo-2-naphthyl]benzamide::N-[3-[(1,1-dioxo-3-thiolanyl)-methylamino]-1,4-dioxo-2-naphthalenyl]benzamide::N-[3-[(1,1-dioxothiolan-3-yl)-methylamino]-1,4-dioxonaphthalen-2-yl]benzamide::N-[3-[[1,1-bis(oxidanylidene)thiolan-3-yl]-methyl-amino]-1,4-bis(oxidanylidene)naphthalen-2-yl]benzamide::SMR000260894::cid_3342467
SMILES CN(C1CCS(=O)(=O)C1)C1=C(NC(=O)c2ccccc2)C(=O)c2ccccc2C1=O
InChI Key InChIKey=AHASJIZTACJIMC-UHFFFAOYSA-N
Data  4 IC50  1 EC50
  Tab Delimited (TSV)   2D SDfile   Computed 3D by Vconf -m prep SDfile
Find this compound or compounds like it in BindingDB:
Activity Spreadsheet -- Enzyme Inhibition Constant Data from BindingDB
Found 5 hits for monomerid = 42255
TargetTyrosine-protein phosphatase YopH(Yersinia enterocolitica)
University Of Pittsburgh
Curated by PubChem BioAssay
LigandPNGBDBM42255(MLS000391861 | N-[3-[(1,1-diketothiolan-3-yl)-meth...)
Affinity DataIC50: >5.00E+4nM. Assay description: Yersinia pestis is the causal agent of the bubonic plague and, although modern antibiotics are extremely effective against the malady, the plague rem...
In DepthDetails PCBioAssay
TargetTyrosine-protein phosphatase YopH(Yersinia enterocolitica)
University Of Pittsburgh
Curated by PubChem BioAssay
LigandPNGBDBM42255(MLS000391861 | N-[3-[(1,1-diketothiolan-3-yl)-meth...)
Affinity DataIC50: >5.00E+4nM. Assay description: Yersinia pestis is the causal agent of the bubonic plague and, although modern antibiotics are extremely effective against the malady, the plague rem...
In DepthDetails PCBioAssay
TargetProtein RecA(Mycobacterium tuberculosis H37Rv)
Southern Research Specialized Biocontainment Screening Center
Curated by PubChem BioAssay
LigandPNGBDBM42255(MLS000391861 | N-[3-[(1,1-diketothiolan-3-yl)-meth...)
Affinity DataIC50:  8.86E+4nM. Assay description: Southern Research's Specialized Biocontainment Screening Center (SRSBSC) Southern Research Institute (Birmingham, Alabama) NIH Molecular Librarie...
In DepthDetails PCBioAssay
TargetHeat shock factor protein 1(Mus musculus)
Broad Institute
Curated by PubChem BioAssay
LigandPNGBDBM42255(MLS000391861 | N-[3-[(1,1-diketothiolan-3-yl)-meth...)
Affinity DataEC50:  3.09E+4nM. Assay description: Keywords: Heat Shock Factor-1 (HSF-1), Stress Response, MG132, NIH3T3, Luminescence Assay Overview: Confirmation testing of small molecules identifie...
In DepthDetails PCBioAssay
TargetTyrosine-protein phosphatase YopH(Yersinia enterocolitica)
University Of Pittsburgh
Curated by PubChem BioAssay
LigandPNGBDBM42255(MLS000391861 | N-[3-[(1,1-diketothiolan-3-yl)-meth...)
Affinity DataIC50: >5.00E+4nM. Assay description: Yersinia pestis is the causal agent of the bubonic plague and, although modern antibiotics are extremely effective against the malady, the plague rem...
In DepthDetails PCBioAssay