BDBM42294 1-(2-fluorophenyl)-3-(4-hydroxybenzyl)-4,6-diketo-5-methyl-1,2,3a,6a-tetrahydropyrrolo[3,4-c]pyrrole-3-carboxylic acid ethyl ester::1-(2-fluorophenyl)-3-[(4-hydroxyphenyl)methyl]-5-methyl-4,6-dioxo-1,2,3a,6a-tetrahydropyrrolo[3,4-c]pyrrole-3-carboxylic acid ethyl ester::3-(2-Fluoro-phenyl)-1-(4-hydroxy-benzyl)-5-methyl-4,6-dioxo-octahydro-pyrrolo[3,4-c]pyrrole-1-carboxylic acid ethyl ester::MLS000075228::SMR000006165::cid_656054::ethyl 1-(2-fluorophenyl)-3-[(4-hydroxyphenyl)methyl]-5-methyl-4,6-bis(oxidanylidene)-1,2,3a,6a-tetrahydropyrrolo[3,4-c]pyrrole-3-carboxylate::ethyl 1-(2-fluorophenyl)-3-[(4-hydroxyphenyl)methyl]-5-methyl-4,6-dioxo-1,2,3a,6a-tetrahydropyrrolo[3,4-c]pyrrole-3-carboxylate
SMILES CCOC(=O)C1(Cc2ccc(O)cc2)NC(C2C1C(=O)N(C)C2=O)c1ccccc1F
InChI Key InChIKey=CLJUXOSYNIMXSO-UHFFFAOYSA-N
Data  1 EC50
  Tab Delimited (TSV)   2D SDfile   Computed 3D by Vconf -m prep SDfile
Find this compound or compounds like it in BindingDB:
Activity Spreadsheet -- Enzyme Inhibition Constant Data from BindingDB
Found 1 hit for monomerid = 42294
TargetLysosomal acid glucosylceramidase(Homo sapiens (Human))
The Scripps Research Institute Molecular Screening Center
Curated by PubChem BioAssay
LigandPNGBDBM42294(1-(2-fluorophenyl)-3-(4-hydroxybenzyl)-4,6-diketo-...)
Affinity DataEC50: >5.00E+4nM. Assay description: Source (MLSCN Center Name): The Scripps Research Institute Molecular Screening Center Center Affiliation: The Scripps Research Institute, TSRI Assay ...
In DepthDetails PCBioAssay