BDBM42315 5-methyl-2-(3-methylphenyl)-7-thien-2-yl-4,7-dihydro[1,2,4]triazolo[1,5-a]pyrimidine-6-carboxamide::5-methyl-2-(3-methylphenyl)-7-thiophen-2-yl-1,7-dihydro-[1,2,4]triazolo[1,5-a]pyrimidine-6-carboxamide::5-methyl-2-(m-tolyl)-7-(2-thienyl)-1,7-dihydro-[1,2,4]triazolo[1,5-a]pyrimidine-6-carboxamide::MLS000043149::SMR000019576::cid_5771278
SMILES CC1=Nc2nc(nn2C(C1C(N)=O)c1cccs1)-c1cccc(C)c1
InChI Key InChIKey=KJOBGLWATYZABS-UHFFFAOYSA-N
Data  1 EC50
  Tab Delimited (TSV)   2D SDfile   Computed 3D by Vconf -m prep SDfile
Find this compound or compounds like it in BindingDB:
Activity Spreadsheet -- Enzyme Inhibition Constant Data from BindingDB
Found 1 hit for monomerid = 42315
TargetLysosomal acid glucosylceramidase(Homo sapiens (Human))
The Scripps Research Institute Molecular Screening Center
Curated by PubChem BioAssay
LigandPNGBDBM42315(5-methyl-2-(3-methylphenyl)-7-thien-2-yl-4,7-dihyd...)
Affinity DataEC50: >5.00E+4nM. Assay description: Source (MLSCN Center Name): The Scripps Research Institute Molecular Screening Center Center Affiliation: The Scripps Research Institute, TSRI Assay ...
Ligand InfoPC cidPC sid
In DepthDetails PCBioAssay