BDBM42334 MLS000047486::N-(3,4-dimethoxyphenyl)-2-(4-p-cumenylsulfonylpiperazino)acetamide::N-(3,4-dimethoxyphenyl)-2-[4-(4-propan-2-ylphenyl)sulfonyl-1-piperazinyl]acetamide::N-(3,4-dimethoxyphenyl)-2-[4-(4-propan-2-ylphenyl)sulfonylpiperazin-1-yl]acetamide::N-(3,4-dimethoxyphenyl)-2-[4-(4-propan-2-ylphenyl)sulfonylpiperazin-1-yl]ethanamide::N-(3,4-dimethoxyphenyl)-2-{4-[(4-isopropylphenyl)sulfonyl]piperazin-1-yl}acetamide::SMR000033497::cid_3238707
SMILES COc1ccc(NC(=O)CN2CCN(CC2)S(=O)(=O)c2ccc(cc2)C(C)C)cc1OC
InChI Key InChIKey=CQOVPDOZPIPSDJ-UHFFFAOYSA-N
Data  1 EC50
  Tab Delimited (TSV)   2D SDfile   Computed 3D by Vconf -m prep SDfile
Find this compound or compounds like it in BindingDB:
Activity Spreadsheet -- Enzyme Inhibition Constant Data from BindingDB
Found 1 hit for monomerid = 42334
TargetLysosomal acid glucosylceramidase(Homo sapiens (Human))
The Scripps Research Institute Molecular Screening Center
Curated by PubChem BioAssay
LigandPNGBDBM42334(MLS000047486 | N-(3,4-dimethoxyphenyl)-2-(4-p-cume...)
Affinity DataEC50: >1.00E+4nM. Assay description: Source (MLSCN Center Name): The Scripps Research Institute Molecular Screening Center Center Affiliation: The Scripps Research Institute, TSRI Assay ...
In DepthDetails PCBioAssay