BDBM42343 5-(3-chlorophenyl)-N-[3-(diethylamino)propyl]-1,2-oxazole-3-carboxamide::5-(3-chlorophenyl)-N-[3-(diethylamino)propyl]-3-isoxazolecarboxamide::5-(3-chlorophenyl)-N-[3-(diethylamino)propyl]isoxazole-3-carboxamide::MLS000087167::SMR000023390::cid_3240493
SMILES CCN(CC)CCCNC(=O)c1cc(on1)-c1cccc(Cl)c1
InChI Key InChIKey=RAOGOTKLNJUKFF-UHFFFAOYSA-N
Data  1 EC50
  Tab Delimited (TSV)   2D SDfile   Computed 3D by Vconf -m prep SDfile
Find this compound or compounds like it in BindingDB:
Activity Spreadsheet -- Enzyme Inhibition Constant Data from BindingDB
Found 1 hit for monomerid = 42343
TargetLysosomal acid glucosylceramidase(Homo sapiens (Human))
The Scripps Research Institute Molecular Screening Center
Curated by PubChem BioAssay
LigandPNGBDBM42343(5-(3-chlorophenyl)-N-[3-(diethylamino)propyl]-1,2-...)
Affinity DataEC50: >5.00E+4nM. Assay description: Source (MLSCN Center Name): The Scripps Research Institute Molecular Screening Center Center Affiliation: The Scripps Research Institute, TSRI Assay ...
In DepthDetails PCBioAssay