BDBM42344 MLS000094169::N-[(2-pyridin-3-yl-1,3-thiazol-4-yl)methyl]-2,3-dihydro-1,4-benzodioxine-6-sulfonamide::N-[[2-(3-pyridinyl)-4-thiazolyl]methyl]-2,3-dihydro-1,4-benzodioxin-6-sulfonamide::N-[[2-(3-pyridyl)thiazol-4-yl]methyl]-2,3-dihydro-1,4-benzodioxin-6-sulfonamide::SMR000029769::cid_3240548
SMILES O=S(=O)(NCc1csc(n1)-c1cccnc1)c1ccc2OCCOc2c1
InChI Key InChIKey=DNFASSXKWVVUKK-UHFFFAOYSA-N
Data  1 EC50
  Tab Delimited (TSV)   2D SDfile   Computed 3D by Vconf -m prep SDfile
Find this compound or compounds like it in BindingDB:
Activity Spreadsheet -- Enzyme Inhibition Constant Data from BindingDB
Found 1 hit for monomerid = 42344
TargetLysosomal acid glucosylceramidase(Homo sapiens (Human))
The Scripps Research Institute Molecular Screening Center
Curated by PubChem BioAssay
LigandPNGBDBM42344(MLS000094169 | N-[(2-pyridin-3-yl-1,3-thiazol-4-yl...)
Affinity DataEC50: >5.00E+4nM. Assay description: Source (MLSCN Center Name): The Scripps Research Institute Molecular Screening Center Center Affiliation: The Scripps Research Institute, TSRI Assay ...
In DepthDetails PCBioAssay