BDBM423458 WO2005113580-Ex-61
SMILES COc1cccc2[nH]c(cc12)C(=O)N[C@@H](CC(C)C)C(=O)N[C@@H](C[C@@H]1CCNC1=O)C(=O)CN(C)C
InChI Key InChIKey=NFBGGGPNURZHKG-VDGAXYAQSA-N
Data  1 EC50
  Tab Delimited (TSV)   2D SDfile   Computed 3D by Vconf -m prep SDfile
Find this compound or compounds like it in BindingDB:
Activity Spreadsheet -- Enzyme Inhibition Constant Data from BindingDB
Found 1 hit for monomerid = 423458
TargetReplicase polyprotein 1ab(Human SARS coronavirus (SARS-CoV) (Severe acute re...)
Pfizer
WIPO
LigandPNGBDBM423458(WO2005113580-Ex-61)
Affinity DataEC50: >1.00E+5nM. Assay description: Protection from SARS Infection: Neutral Red Endpoint The ability of compounds to protect cells against infection by the SARS coronavirus is measured ...
Ligand InfoPC cidPC sid
In DepthDetails PubMed