BDBM42353 3-methyl-7-propan-2-yl-8-sulfanylidene-9H-purine-2,6-dione::7-isopropyl-3-methyl-8-thioxo-3,7,8,9-tetrahydro-1H-purine-2,6-dione::7-isopropyl-3-methyl-8-thioxo-9H-purine-2,6-quinone::MLS000087713::SMR000082834::cid_840403
SMILES CC(C)n1c2c([nH]c1=S)n(C)c(=O)[nH]c2=O
InChI Key InChIKey=BIPXEDYGKRHJHF-UHFFFAOYSA-N
Data  1 EC50
  Tab Delimited (TSV)   2D SDfile   Computed 3D by Vconf -m prep SDfile
Find this compound or compounds like it in BindingDB:
Activity Spreadsheet -- Enzyme Inhibition Constant Data from BindingDB
Found 1 hit for monomerid = 42353
TargetLysosomal acid glucosylceramidase(Homo sapiens (Human))
The Scripps Research Institute Molecular Screening Center
Curated by PubChem BioAssay
LigandPNGBDBM42353(3-methyl-7-propan-2-yl-8-sulfanylidene-9H-purine-2...)
Affinity DataEC50: >5.00E+4nM. Assay description: Source (MLSCN Center Name): The Scripps Research Institute Molecular Screening Center Center Affiliation: The Scripps Research Institute, TSRI Assay ...
In DepthDetails PCBioAssay