BDBM42364 MLS000087724::N-(2-keto-8-methoxy-chromen-3-yl)cyclohexanecarboxamide::N-(8-methoxy-2-oxidanylidene-chromen-3-yl)cyclohexanecarboxamide::N-(8-methoxy-2-oxo-1-benzopyran-3-yl)cyclohexanecarboxamide::N-(8-methoxy-2-oxo-2H-chromen-3-yl)cyclohexanecarboxamide::N-(8-methoxy-2-oxochromen-3-yl)cyclohexanecarboxamide::SMR000023945::cid_3244097
SMILES COc1cccc2cc(NC(=O)C3CCCCC3)c(=O)oc12
InChI Key InChIKey=WVUQUXZEAUCRBK-UHFFFAOYSA-N
Data  1 EC50
  Tab Delimited (TSV)   2D SDfile   Computed 3D by Vconf -m prep SDfile
Find this compound or compounds like it in BindingDB:
Activity Spreadsheet -- Enzyme Inhibition Constant Data from BindingDB
Found 1 hit for monomerid = 42364
TargetLysosomal acid glucosylceramidase(Homo sapiens (Human))
The Scripps Research Institute Molecular Screening Center
Curated by PubChem BioAssay
LigandPNGBDBM42364(MLS000087724 | N-(2-keto-8-methoxy-chromen-3-yl)cy...)
Affinity DataEC50: >5.00E+4nM. Assay description: Source (MLSCN Center Name): The Scripps Research Institute Molecular Screening Center Center Affiliation: The Scripps Research Institute, TSRI Assay ...
In DepthDetails PCBioAssay