BDBM42390 1-(3,5-dimethylphenyl)-5-keto-pyrrolidine-3-carboxylic acid::1-(3,5-dimethylphenyl)-5-oxidanylidene-pyrrolidine-3-carboxylic acid::1-(3,5-dimethylphenyl)-5-oxo-3-pyrrolidinecarboxylic acid::1-(3,5-dimethylphenyl)-5-oxopyrrolidine-3-carboxylic acid::MLS000066230::SMR000079860::cid_2741834
SMILES Cc1cc(C)cc(c1)N1CC(CC1=O)C(O)=O
InChI Key InChIKey=ZVYUEYJQRCOJDI-UHFFFAOYSA-N
Data  1 EC50
  Tab Delimited (TSV)   2D SDfile   Computed 3D by Vconf -m prep SDfile
Find this compound or compounds like it in BindingDB:
Activity Spreadsheet -- Enzyme Inhibition Constant Data from BindingDB
Found 1 hit for monomerid = 42390
TargetLysosomal acid glucosylceramidase(Homo sapiens (Human))
The Scripps Research Institute Molecular Screening Center
Curated by PubChem BioAssay
LigandPNGBDBM42390(1-(3,5-dimethylphenyl)-5-keto-pyrrolidine-3-carbox...)
Affinity DataEC50: >5.00E+4nM. Assay description: Source (MLSCN Center Name): The Scripps Research Institute Molecular Screening Center Center Affiliation: The Scripps Research Institute, TSRI Assay ...
In DepthDetails PCBioAssay