BDBM42406 1-phenyl-3-(3-pyridinyl)-4-pyrazolecarboxylic acid methyl ester::1-phenyl-3-(3-pyridyl)pyrazole-4-carboxylic acid methyl ester::MLS000110650::SMR000106579::cid_752167::methyl 1-phenyl-3-pyridin-3-yl-pyrazole-4-carboxylate::methyl 1-phenyl-3-pyridin-3-ylpyrazole-4-carboxylate
SMILES COC(=O)c1cn(nc1-c1cccnc1)-c1ccccc1
InChI Key InChIKey=FHRFYYRLSIONME-UHFFFAOYSA-N
Data  1 EC50
  Tab Delimited (TSV)   2D SDfile   Computed 3D by Vconf -m prep SDfile
Find this compound or compounds like it in BindingDB:
Activity Spreadsheet -- Enzyme Inhibition Constant Data from BindingDB
Found 1 hit for monomerid = 42406
TargetLysosomal acid glucosylceramidase(Homo sapiens (Human))
The Scripps Research Institute Molecular Screening Center
Curated by PubChem BioAssay
LigandPNGBDBM42406(1-phenyl-3-(3-pyridinyl)-4-pyrazolecarboxylic acid...)
Affinity DataEC50: >5.00E+4nM. Assay description: Source (MLSCN Center Name): The Scripps Research Institute Molecular Screening Center Center Affiliation: The Scripps Research Institute, TSRI Assay ...
In DepthDetails PCBioAssay