BDBM42414 (4E)-3-hydroxy-4-[4-(4-methoxyphenoxy)-5-methyl-1,2-dihydropyrazol-3-ylidene]-1-cyclohexa-2,5-dienone::(4E)-3-hydroxy-4-[4-(4-methoxyphenoxy)-5-methyl-1,2-dihydropyrazol-3-ylidene]cyclohexa-2,5-dien-1-one::(4E)-3-hydroxy-4-[4-(4-methoxyphenoxy)-5-methyl-3-pyrazolin-3-ylidene]cyclohexa-2,5-dien-1-one::(4E)-4-[4-(4-methoxyphenoxy)-5-methyl-1,2-dihydropyrazol-3-ylidene]-3-oxidanyl-cyclohexa-2,5-dien-1-one::MLS000042418::SMR000047897::cid_5390025
SMILES COc1ccc(Oc2c(C)[nH]nc2-c2ccc(O)cc2O)cc1
InChI Key InChIKey=AZSKFDMVCSRCDG-UHFFFAOYSA-N
Data  2 IC50
  Tab Delimited (TSV)   2D SDfile   Computed 3D by Vconf -m prep SDfile
Find this compound or compounds like it in BindingDB:
Activity Spreadsheet -- Enzyme Inhibition Constant Data from BindingDB
Found 2 hits for monomerid = 42414
TargetNeuropeptide Y receptor type 2(Homo sapiens (Human))
The Scripps Research Institute Molecular Screening Center
Curated by PubChem BioAssay
LigandPNGBDBM42414((4E)-3-hydroxy-4-[4-(4-methoxyphenoxy)-5-methyl-1,...)
Affinity DataIC50: >3.50E+4nM. Assay description: Source (MLSCN Center Name): The Scripps Research Institute Molecular Screening Center Affiliation: The Scripps Research Institute, TSRI Assay Provide...
In DepthDetails PCBioAssay
TargetNeuropeptide Y receptor type 1(Homo sapiens (Human))
The Scripps Research Institute Molecular Screening Center
Curated by PubChem BioAssay
LigandPNGBDBM42414((4E)-3-hydroxy-4-[4-(4-methoxyphenoxy)-5-methyl-1,...)
Affinity DataIC50: >3.50E+4nM. Assay description: Source (MLSCN Center Name): The Scripps Research Institute Molecular Screening Center Affiliation: The Scripps Research Institute, TSRI Assay Provide...
In DepthDetails PCBioAssay