BDBM42431 MLS000589265::N'-(2-Butyl-2-hydroxy-hexanoyl)-N-phenyl-hydrazinecarboxylic acid methyl ester::N-[(2-butyl-2-hydroxy-1-oxohexyl)amino]-N-phenylcarbamic acid methyl ester::N-[(2-butyl-2-hydroxy-hexanoyl)amino]-N-phenyl-carbamic acid methyl ester::SMR000212665::cid_1899455::methyl N-[(2-butyl-2-hydroxyhexanoyl)amino]-N-phenylcarbamate::methyl N-[(2-butyl-2-oxidanyl-hexanoyl)amino]-N-phenyl-carbamate
SMILES CCCCC(O)(CCCC)C(=O)NN(C(=O)OC)c1ccccc1
InChI Key InChIKey=ZTTHCWMHGCGJEJ-UHFFFAOYSA-N
Data  2 IC50
  Tab Delimited (TSV)   2D SDfile   Computed 3D by Vconf -m prep SDfile
Find this compound or compounds like it in BindingDB:
Activity Spreadsheet -- Enzyme Inhibition Constant Data from BindingDB
Found 2 hits for monomerid = 42431
TargetNeuropeptide Y receptor type 2(Homo sapiens (Human))
The Scripps Research Institute Molecular Screening Center
Curated by PubChem BioAssay
LigandPNGBDBM42431(MLS000589265 | N'-(2-Butyl-2-hydroxy-hexanoyl)...)
Affinity DataIC50: >3.50E+4nM. Assay description: Source (MLSCN Center Name): The Scripps Research Institute Molecular Screening Center Affiliation: The Scripps Research Institute, TSRI Assay Provide...
In DepthDetails PCBioAssay
TargetNeuropeptide Y receptor type 1(Homo sapiens (Human))
The Scripps Research Institute Molecular Screening Center
Curated by PubChem BioAssay
LigandPNGBDBM42431(MLS000589265 | N'-(2-Butyl-2-hydroxy-hexanoyl)...)
Affinity DataIC50: >3.50E+4nM. Assay description: Source (MLSCN Center Name): The Scripps Research Institute Molecular Screening Center Affiliation: The Scripps Research Institute, TSRI Assay Provide...
In DepthDetails PCBioAssay