BDBM424924 N-(1-methyl-1H-pyrazol-5- yl)-4-(3-phenyl-4,5-dihydro- 3H-1,2,2a1,5- tetraazaacenaphthylen-7- yl)pyridin-2-amine::US10517878, Compound I-4::US10842799, I-4
SMILES Cn1nccc1Nc1cc(ccn1)-c1cc2NCC(c3nnc(c1)n23)c1ccccc1
InChI Key InChIKey=UGZNKBMSQCQJKS-UHFFFAOYSA-N
Data  2 IC50
  Tab Delimited (TSV)   2D SDfile   Computed 3D by Vconf -m prep SDfile
Find this compound or compounds like it in BindingDB:
Activity Spreadsheet -- Enzyme Inhibition Constant Data from BindingDB
Found 2 hits for monomerid = 424924
TargetMitogen-activated protein kinase 1(Homo sapiens (Human))
Genentech
US Patent
LigandPNGBDBM424924(N-(1-methyl-1H-pyrazol-5- yl)-4-(3-phenyl-4,5-dihy...)
Affinity DataIC50: <0.0200nM. Assay description: Compounds were tested in an enzymatic assay using human ERK-2 (Mitogen Activated Kinase 1), recombinantly expressed as an n-terminal 6-His fusion pro...
Ligand InfoPC cidPC sid
In DepthDetails US Patent
TargetMitogen-activated protein kinase 1(Homo sapiens (Human))
Genentech
US Patent
LigandPNGBDBM424924(N-(1-methyl-1H-pyrazol-5- yl)-4-(3-phenyl-4,5-dihy...)
Affinity DataIC50: <0.0200nM. Assay description: Compounds were tested in an enzymatic assay using human ERK-2 (Mitogen Activated Kinase 1), recombinantly expressed as an n-terminal 6-His fusion pro...
Ligand InfoPC cidPC sid
In DepthDetails US Patent