BDBM426360 US10526325, Compound A36::US10829489, Compound A36::US11261185, Example 36
SMILES COc1ncc(F)c(n1)-n1ncc2CN(C[C@@H](C)c12)C(=O)[C@@](C)(O)C(F)(F)F
InChI Key InChIKey=WEZLZAMTQYFZDH-ANRSDYALSA-N
Data  3 IC50
  Tab Delimited (TSV)   2D SDfile   Computed 3D by Vconf -m prep SDfile
Find this compound or compounds like it in BindingDB:
Activity Spreadsheet -- Enzyme Inhibition Constant Data from BindingDB
Found 3 hits for monomerid = 426360
LigandPNGBDBM426360(US10526325, Compound A36 | US10829489, Compound A3...)
Affinity DataIC50:  1.65E+3nM. Assay description: ITC measurements were performed with a VP-ITC micro calorimeter. In general titrations were performed by titrating the protein (50 μM) to the te...
Ligand InfoPC cidPC sid
In DepthDetails US Patent
LigandPNGBDBM426360(US10526325, Compound A36 | US10829489, Compound A3...)
Affinity DataIC50:  1.65E+3nM. Assay description: The biochemical activity assay for PDHK2 is based on the inactivation of PDC through phosphorylation by PDHK2. The assay is run in two steps: the enz...
Ligand InfoPC cidPC sid
In DepthDetails US Patent
LigandPNGBDBM426360(US10526325, Compound A36 | US10829489, Compound A3...)
Affinity DataIC50:  1.65E+3nM. Assay description: The PDC inactivation assay is performed in Greiner 384-well microtiter plates and is used for high throughput screen. 4 μl of PDHK2 (human, rec,...
Ligand InfoPC cidPC sid
In DepthDetails US Patent