BDBM426365 US10526325, Compound A41::US10829489, Compound A41::US11261185, Example 41
SMILES C[C@H]1CN(Cc2cnn(c12)-c1ccc(F)cn1)C(=O)[C@@](C)(O)C(F)(F)F
InChI Key InChIKey=NRVZUOVIGIPSGE-BJOHPYRUSA-N
Data  3 IC50
  Tab Delimited (TSV)   2D SDfile   Computed 3D by Vconf -m prep SDfile
Find this compound or compounds like it in BindingDB:
Activity Spreadsheet -- Enzyme Inhibition Constant Data from BindingDB
Found 3 hits for monomerid = 426365
LigandPNGBDBM426365(US10526325, Compound A41 | US10829489, Compound A4...)
Affinity DataIC50:  2.65E+4nM. Assay description: ITC measurements were performed with a VP-ITC micro calorimeter. In general titrations were performed by titrating the protein (50 μM) to the te...
Ligand InfoPC cidPC sid
In DepthDetails US Patent
LigandPNGBDBM426365(US10526325, Compound A41 | US10829489, Compound A4...)
Affinity DataIC50:  2.65E+4nM. Assay description: The biochemical activity assay for PDHK2 is based on the inactivation of PDC through phosphorylation by PDHK2. The assay is run in two steps: the enz...
Ligand InfoPC cidPC sid
In DepthDetails US Patent
LigandPNGBDBM426365(US10526325, Compound A41 | US10829489, Compound A4...)
Affinity DataIC50:  2.65E+4nM. Assay description: The PDC inactivation assay is performed in Greiner 384-well microtiter plates and is used for high throughput screen. 4 μl of PDHK2 (human, rec,...
Ligand InfoPC cidPC sid
In DepthDetails US Patent