BDBM42720 MLS000094354::N-(2-imidazo[1,2-a]pyridinylmethyl)-3,4,5-trimethoxybenzamide::N-(imidazo[1,2-a]pyridin-2-ylmethyl)-3,4,5-trimethoxy-benzamide::N-(imidazo[1,2-a]pyridin-2-ylmethyl)-3,4,5-trimethoxybenzamide::SMR000016898::cid_3241191
SMILES COc1cc(cc(OC)c1OC)C(=O)NCc1cn2ccccc2n1
InChI Key InChIKey=KBEXGPXJYAOGCF-UHFFFAOYSA-N
Data  1 IC50
  Tab Delimited (TSV)   2D SDfile   Computed 3D by Vconf -m prep SDfile
Find this compound or compounds like it in BindingDB:
Activity Spreadsheet -- Enzyme Inhibition Constant Data from BindingDB
Found 1 hit for monomerid = 42720
TargetMitogen-activated protein kinase 10(Homo sapiens (Human))
The Scripps Research Institute Molecular Screening Center
Curated by PubChem BioAssay
LigandPNGBDBM42720(MLS000094354 | N-(2-imidazo[1,2-a]pyridinylmethyl)...)
Affinity DataIC50:  7.87E+3nM. Assay description: Source (MLSCN Center Name): The Scripps Research Institute Molecular Screening Center Affiliation: The Scripps Research Institute, TSRI Assay Provide...
In DepthDetails PCBioAssay