BDBM42842 2-benzamido-N-methyl-3-thiophenecarboxamide::2-benzamido-N-methyl-thiophene-3-carboxamide::2-benzamido-N-methylthiophene-3-carboxamide::MLS000103262::SMR000018672::cid_5309978
SMILES CNC(=O)c1ccsc1NC(=O)c1ccccc1
InChI Key InChIKey=JPNMQJFTAFUPFW-UHFFFAOYSA-N
Data  1 IC50
  Tab Delimited (TSV)   2D SDfile   Computed 3D by Vconf -m prep SDfile
Find this compound or compounds like it in BindingDB:
Activity Spreadsheet -- Enzyme Inhibition Constant Data from BindingDB
Found 1 hit for monomerid = 42842
TargetMitogen-activated protein kinase 10(Homo sapiens (Human))
The Scripps Research Institute Molecular Screening Center
Curated by PubChem BioAssay
LigandPNGBDBM42842(2-benzamido-N-methyl-3-thiophenecarboxamide | 2-be...)
Affinity DataIC50:  5.46E+3nM. Assay description: Source (MLSCN Center Name): The Scripps Research Institute Molecular Screening Center Affiliation: The Scripps Research Institute, TSRI Assay Provide...
In DepthDetails PCBioAssay