BDBM428990 jm5b01461, Compound 25
SMILES CC(C)C[C@H](NC(=O)C(NC(=O)[C@@H](NC(C)=O)C(C)C)C(C)OCc1ccccc1)C(=O)N[C@@H](C[C@@H]1CCNC1=O)C(=O)Cn1[nH]c(=O)c2c(cccc2c1=O)[N+]([O-])=O
InChI Key InChIKey=TYWILPQKGVLDRA-UIQXPBATSA-N
Data  1 IC50
  Tab Delimited (TSV)   2D SDfile   Computed 3D by Vconf -m prep SDfile
Find this compound or compounds like it in BindingDB:
Activity Spreadsheet -- Enzyme Inhibition Constant Data from BindingDB
Found 1 hit for monomerid = 428990
TargetReplicase polyprotein 1ab(Human SARS coronavirus (SARS-CoV) (Severe acute re...)
University Of Bonn
LigandPNGBDBM428990(jm5b01461, Compound 25)
Affinity DataIC50:  600nM. Assay description: This is a review article.
Ligand InfoPC cidPC sid
In DepthDetails ArticlePubMed