BDBM429077 jm5b01461, Compound 30
SMILES [O-][N+](=O)c1ccc(NC(=O)[C@H](Cc2ccccc2)NC(=O)c2ccccc2)c(Cl)c1
InChI Key InChIKey=FXDVSEXSZHQYNI-FQEVSTJZSA-N
Data  2 IC50
  Tab Delimited (TSV)   2D SDfile   Computed 3D by Vconf -m prep SDfile
Find this compound or compounds like it in BindingDB:
Activity Spreadsheet -- Enzyme Inhibition Constant Data from BindingDB
Found 2 hits for monomerid = 429077
TargetReplicase polyprotein 1ab(Human SARS coronavirus (SARS-CoV) (Severe acute re...)
University Of Bonn
LigandPNGBDBM429077(jm5b01461, Compound 30)
Affinity DataIC50: >1.00E+4nM. Assay description: This is a review article.
Ligand InfoPC cidPC sid
In DepthDetails ArticlePubMed
TargetReplicase polyprotein 1ab(Human SARS coronavirus (SARS-CoV) (Severe acute re...)
University Of Bonn
LigandPNGBDBM429077(jm5b01461, Compound 30)
Affinity DataIC50: >1.00E+4nM. Assay description: This is a review article.
Ligand InfoPC cidPC sid
In DepthDetails ArticlePubMed