BDBM429138 jm5b01461, Compound 49
SMILES CC(C)C[C@H](NC(=O)OCc1ccccc1)C(=O)N[C@@H](CCC(=O)N(C)C)C(=O)CF
InChI Key InChIKey=UBPKJZUVHMCXAZ-ROUUACIJSA-N
Data  1 IC50  1 EC50
  Tab Delimited (TSV)   2D SDfile   Computed 3D by Vconf -m prep SDfile
Find this compound or compounds like it in BindingDB:
Activity Spreadsheet -- Enzyme Inhibition Constant Data from BindingDB
Found 2 hits for monomerid = 429138
TargetReplicase polyprotein 1ab(Human SARS coronavirus (SARS-CoV) (Severe acute re...)
University Of Bonn
LigandPNGBDBM429138(jm5b01461, Compound 49)
Affinity DataEC50:  1.00E+4nM. Assay description: This is a review article.
Ligand InfoPC cidPC sid
In DepthDetails ArticlePubMed
TargetReplicase polyprotein 1ab(Human SARS coronavirus (SARS-CoV) (Severe acute re...)
University Of Bonn
LigandPNGBDBM429138(jm5b01461, Compound 49)
Affinity DataIC50:  3.60E+3nM. Assay description: This is a review article.
Ligand InfoPC cidPC sid
In DepthDetails ArticlePubMed