BDBM42925 (2E)-2-(3-methyl-1H-benzimidazol-2-ylidene)-4-(2-naphthalenyloxy)-3-oxobutanenitrile::(2E)-2-(3-methyl-1H-benzimidazol-2-ylidene)-4-naphthalen-2-yloxy-3-oxidanylidene-butanenitrile::(2E)-2-(3-methyl-1H-benzimidazol-2-ylidene)-4-naphthalen-2-yloxy-3-oxobutanenitrile::(2E)-3-keto-2-(3-methyl-1H-benzimidazol-2-ylidene)-4-(2-naphthoxy)butyronitrile::MLS000055275::SMR000061763::cid_5742548
SMILES Cn1c(nc2ccccc12)C(C#N)C(=O)COc1ccc2ccccc2c1
InChI Key InChIKey=BNYUSRDDRBVYDE-UHFFFAOYSA-N
Data  5 EC50
  Tab Delimited (TSV)   2D SDfile   Computed 3D by Vconf -m prep SDfile
Find this compound or compounds like it in BindingDB:
Activity Spreadsheet -- Enzyme Inhibition Constant Data from BindingDB
Found 5 hits for monomerid = 42925
TargetNuclear receptor coactivator 3(Homo sapiens (Human))
The Scripps Research Institute Molecular Screening Center
Curated by PubChem BioAssay
LigandPNGBDBM42925((2E)-2-(3-methyl-1H-benzimidazol-2-ylidene)-4-(2-n...)
Affinity DataEC50: >7.94E+4nM. Assay description: Source (MLSCN Center Name): The Scripps Research Institute Molecular Screening Center http://molscreen.florida.scripps.edu/ Center Affiliation: The ...
In DepthDetails PCBioAssay
TargetNuclear receptor coactivator 2(Homo sapiens (Human))
The Scripps Research Institute Molecular Screening Center
Curated by PubChem BioAssay
LigandPNGBDBM42925((2E)-2-(3-methyl-1H-benzimidazol-2-ylidene)-4-(2-n...)
Affinity DataEC50: >7.94E+4nM. Assay description: Source (MLSCN Center Name): The Scripps Research Institute Molecular Screening Center Center Affiliation: The Scripps Research Institute (TSRI) Assay...
In DepthDetails PCBioAssay
TargetEndoribonuclease toxin MazF(Escherichia coli str. K-12 substr. MG1655)
Burnham Center For Chemical Genomics
Curated by PubChem BioAssay
LigandPNGBDBM42925((2E)-2-(3-methyl-1H-benzimidazol-2-ylidene)-4-(2-n...)
Affinity DataEC50: >9.90E+4nM. Assay description: Data Source: Sanford-Burnham Center for Chemical Genomics (SBCCG) Source Affiliation: Sanford-Burnham Medical Research Institute (SBMRI, San Diego, C...
In DepthDetails PCBioAssay
TargetEndoribonuclease toxin MazF(Escherichia coli str. K-12 substr. MG1655)
Burnham Center For Chemical Genomics
Curated by PubChem BioAssay
LigandPNGBDBM42925((2E)-2-(3-methyl-1H-benzimidazol-2-ylidene)-4-(2-n...)
Affinity DataEC50: >9.90E+4nM. Assay description: Data Source: Sanford-Burnham Center for Chemical Genomics (SBCCG) Source Affiliation: Sanford-Burnham Medical Research Institute (SBMRI, San Diego, C...
In DepthDetails PCBioAssay
TargetNuclear receptor coactivator 1(Homo sapiens (Human))
The Scripps Research Institute Molecular Screening Center
Curated by PubChem BioAssay
LigandPNGBDBM42925((2E)-2-(3-methyl-1H-benzimidazol-2-ylidene)-4-(2-n...)
Affinity DataEC50: >7.94E+4nM. Assay description: Source (MLSCN Center Name): The Scripps Research Institute Molecular Screening Center Center Affiliation: The Scripps Research Institute (TSRI) Assay...
In DepthDetails PCBioAssay