BDBM429259 jm5b01461, Compound 77
SMILES [O-][N+](=O)c1cccc2C(=O)C(=O)C(Cc3cc4ccccc4s3)c12
InChI Key InChIKey=HRGTVSWPWYVMGR-UHFFFAOYSA-N
Data  1 IC50
  Tab Delimited (TSV)   2D SDfile   Computed 3D by Vconf -m prep SDfile
Find this compound or compounds like it in BindingDB:
Activity Spreadsheet -- Enzyme Inhibition Constant Data from BindingDB
Found 1 hit for monomerid = 429259
TargetReplicase polyprotein 1ab(Human SARS coronavirus (SARS-CoV) (Severe acute re...)
University Of Bonn
LigandPNGBDBM429259(jm5b01461, Compound 77)
Affinity DataIC50:  2.00E+3nM. Assay description: This is a review article.
Ligand InfoPC cidPC sid
In DepthDetails ArticlePubMed