BDBM429280 jm5b01461, Compound 98
SMILES CC1=C(O)C(O)C=C2C1=CC=C1[C@@]2(C)CC[C@@]2(C)C3C[C@@](C)(CC[C@]3(C)CC[C@]12C)C(O)=O
InChI Key InChIKey=SLLOAFOXLXWLPA-WNGNNJIVSA-N
Data  1 IC50
  Tab Delimited (TSV)   2D SDfile   Computed 3D by Vconf -m prep SDfile
Find this compound or compounds like it in BindingDB:
Activity Spreadsheet -- Enzyme Inhibition Constant Data from BindingDB
Found 1 hit for monomerid = 429280
TargetReplicase polyprotein 1ab(Human SARS coronavirus (SARS-CoV) (Severe acute re...)
University Of Bonn
LigandPNGBDBM429280(jm5b01461, Compound 98)
Affinity DataIC50:  2.17E+4nM. Assay description: This is a review article.
Ligand InfoPC cidPC sid
In DepthDetails ArticlePubMed