BDBM429315 jm5b01461, Compound 135
SMILES OC(=O)c1ccc(\C=C2\C(NN(C2=O)c2ccc(cc2)C#N)c2ccccc2)cc1
InChI Key InChIKey=HAAFCLXJXGIIDT-STZFKDTASA-N
Data  2 IC50
  Tab Delimited (TSV)   2D SDfile   Computed 3D by Vconf -m prep SDfile
Find this compound or compounds like it in BindingDB:
Activity Spreadsheet -- Enzyme Inhibition Constant Data from BindingDB
Found 2 hits for monomerid = 429315
TargetReplicase polyprotein 1ab(Human SARS coronavirus (SARS-CoV) (Severe acute re...)
University Of Bonn
LigandPNGBDBM429315(jm5b01461, Compound 135)
Affinity DataIC50:  5.50E+3nM. Assay description: This is a review article.
Ligand InfoPC cidPC sid
In DepthDetails ArticlePubMed
TargetReplicase polyprotein 1ab(Human SARS coronavirus (SARS-CoV) (Severe acute re...)
University Of Bonn
LigandPNGBDBM429315(jm5b01461, Compound 135)
Affinity DataIC50:  5.50E+3nM. Assay description: This is a review article.
Ligand InfoPC cidPC sid
In DepthDetails ArticlePubMed