BDBM429326 jm5b01461, Compound 144
SMILES Fc1ccc(cc1)C(=O)N1CC2CCCCC2CC1CNC(Cc1c[nH]cn1)C=O
InChI Key
Data  1 IC50
  Tab Delimited (TSV)   2D SDfile   Computed 3D by Vconf -m prep SDfile
Find this compound or compounds like it in BindingDB:
Activity Spreadsheet -- Enzyme Inhibition Constant Data from BindingDB
Found 1 hit for monomerid = 429326
TargetReplicase polyprotein 1ab(Human SARS coronavirus (SARS-CoV) (Severe acute re...)
University Of Bonn
LigandPNGBDBM429326(jm5b01461, Compound 144)
Affinity DataIC50:  5.70E+3nM. Assay description: This is a review article.
Ligand InfoPC cidPC sid
In DepthDetails ArticlePubMed