BDBM43002 3-benzyl-8-(3-methoxy-4-phenylmethoxyphenyl)-6-oxo-2,4,7,8-tetrahydropyrido[2,1-b][1,3,5]thiadiazine-9-carbonitrile::8-(3-methoxy-4-phenylmethoxy-phenyl)-6-oxidanylidene-3-(phenylmethyl)-2,4,7,8-tetrahydropyrido[2,1-b][1,3,5]thiadiazine-9-carbonitrile::8-(3-methoxy-4-phenylmethoxyphenyl)-6-oxo-3-(phenylmethyl)-2,4,7,8-tetrahydropyrido[2,1-b][1,3,5]thiadiazine-9-carbonitrile::8-(4-benzoxy-3-methoxy-phenyl)-3-benzyl-6-keto-2,4,7,8-tetrahydropyrido[2,1-b][1,3,5]thiadiazine-9-carbonitrile::MLS000522487::SMR000127754::cid_9550998
SMILES COc1cc(ccc1OCc1ccccc1)C1CC(=O)N2CN(Cc3ccccc3)CSC2=C1C#N
InChI Key InChIKey=LZLBQWNYNRVULB-UHFFFAOYSA-N
Data  3 EC50
  Tab Delimited (TSV)   2D SDfile   Computed 3D by Vconf -m prep SDfile
Find this compound or compounds like it in BindingDB:
Activity Spreadsheet -- Enzyme Inhibition Constant Data from BindingDB
Found 3 hits for monomerid = 43002
TargetNuclear receptor coactivator 1(Homo sapiens (Human))
The Scripps Research Institute Molecular Screening Center
Curated by PubChem BioAssay
LigandPNGBDBM43002(3-benzyl-8-(3-methoxy-4-phenylmethoxyphenyl)-6-oxo...)
Affinity DataEC50: >7.94E+4nM. Assay description: Source (MLSCN Center Name): The Scripps Research Institute Molecular Screening Center Center Affiliation: The Scripps Research Institute (TSRI) Assay...
In DepthDetails PCBioAssay
TargetNuclear receptor coactivator 2(Homo sapiens (Human))
The Scripps Research Institute Molecular Screening Center
Curated by PubChem BioAssay
LigandPNGBDBM43002(3-benzyl-8-(3-methoxy-4-phenylmethoxyphenyl)-6-oxo...)
Affinity DataEC50: >7.94E+4nM. Assay description: Source (MLSCN Center Name): The Scripps Research Institute Molecular Screening Center Center Affiliation: The Scripps Research Institute (TSRI) Assay...
In DepthDetails PCBioAssay
TargetNuclear receptor coactivator 3(Homo sapiens (Human))
The Scripps Research Institute Molecular Screening Center
Curated by PubChem BioAssay
LigandPNGBDBM43002(3-benzyl-8-(3-methoxy-4-phenylmethoxyphenyl)-6-oxo...)
Affinity DataEC50: >7.94E+4nM. Assay description: Source (MLSCN Center Name): The Scripps Research Institute Molecular Screening Center http://molscreen.florida.scripps.edu/ Center Affiliation: The ...
In DepthDetails PCBioAssay