BDBM43034 MLS000544068::N,N-dimethyl-4-[[(2Z)-2-(1,3,3-trimethyl-2-indolylidene)ethylidene]amino]aniline::N,N-dimethyl-4-[[(2Z)-2-(1,3,3-trimethylindol-2-ylidene)ethylidene]amino]aniline::N-[4-(dimethylamino)phenyl]-N-[2-(1,3,3-trimethyl-1,3-dihydro-2H-indol-2-ylidene)ethylidene]amine::SMR000162890::cid_1676177::dimethyl-[4-[[(2Z)-2-(1,3,3-trimethylindolin-2-ylidene)ethylidene]amino]phenyl]amine
SMILES CN(C)c1ccc(cc1)\N=C\C=C1/N(C)c2ccccc2C1(C)C
InChI Key InChIKey=JWYJYJWDFHHNRC-UAKSEAGPSA-N
Data  3 EC50
  Tab Delimited (TSV)   2D SDfile   Computed 3D by Vconf -m prep SDfile
Find this compound or compounds like it in BindingDB:
Activity Spreadsheet -- Enzyme Inhibition Constant Data from BindingDB
Found 3 hits for monomerid = 43034
TargetNuclear receptor coactivator 1(Homo sapiens (Human))
The Scripps Research Institute Molecular Screening Center
Curated by PubChem BioAssay
LigandPNGBDBM43034(MLS000544068 | N,N-dimethyl-4-[[(2Z)-2-(1,3,3-trim...)
Affinity DataEC50: >7.94E+4nM. Assay description: Source (MLSCN Center Name): The Scripps Research Institute Molecular Screening Center Center Affiliation: The Scripps Research Institute (TSRI) Assay...
In DepthDetails PCBioAssay
TargetNuclear receptor coactivator 2(Homo sapiens (Human))
The Scripps Research Institute Molecular Screening Center
Curated by PubChem BioAssay
LigandPNGBDBM43034(MLS000544068 | N,N-dimethyl-4-[[(2Z)-2-(1,3,3-trim...)
Affinity DataEC50: >7.94E+4nM. Assay description: Source (MLSCN Center Name): The Scripps Research Institute Molecular Screening Center Center Affiliation: The Scripps Research Institute (TSRI) Assay...
In DepthDetails PCBioAssay
TargetNuclear receptor coactivator 3(Homo sapiens (Human))
The Scripps Research Institute Molecular Screening Center
Curated by PubChem BioAssay
LigandPNGBDBM43034(MLS000544068 | N,N-dimethyl-4-[[(2Z)-2-(1,3,3-trim...)
Affinity DataEC50: >7.94E+4nM. Assay description: Source (MLSCN Center Name): The Scripps Research Institute Molecular Screening Center http://molscreen.florida.scripps.edu/ Center Affiliation: The ...
In DepthDetails PCBioAssay