BDBM430653 Oxyclozanide
SMILES Oc1c(Cl)cc(Cl)cc1NC(=O)c1c(O)c(Cl)cc(Cl)c1Cl
InChI Key InChIKey=JYWIYHUXVMAGLG-UHFFFAOYSA-N
Data  2 IC50
  Tab Delimited (TSV)   2D SDfile   Computed 3D by Vconf -m prep SDfile
Find this compound or compounds like it in BindingDB:
Activity Spreadsheet -- Enzyme Inhibition Constant Data from BindingDB
Found 2 hits for monomerid = 430653
TargetEndoplasmic reticulum chaperone BiP(Homo sapiens (Human))
University Of Arizona
Curated by ChEMBL
LigandPNGBDBM430653(Oxyclozanide)
Affinity DataIC50:  1.00E+5nM. Assay description: Inhibition of GRP78 (26 to 636 residues) (unknown origin) expressed in Escherichia coli BL21 DE3 cells pre-incubated for 10 mins before FITC-NRLLLTG ...
In DepthDetails ArticlePubMed
TargetReplicase polyprotein 1ab(2019-nCoV)
Institut Pasteur Korea
LigandPNGBDBM430653(Oxyclozanide)
Affinity DataIC50:  3.71E+3nM. Assay description: Ten-point DRCs were generated for each drug. Vero cells were seeded at 1.2 × 104 cells per well in DMEM, supplemented with 2% FBS and 1× ...
In DepthDetails ArticlePubMed