BDBM431032 5-[5-fluoro-6-(piperidin-4-ylmethoxy)-2,3-dihydro-1H-isoindol-2-yl]-4-(trifluoromethyl)-2,3-dihydropyridazin-3-one::US10550105, Example 20::US10870641, Example 20::US11014913, Example 20
SMILES Fc1cc2CN(Cc2cc1OCC1CCNCC1)c1cn[nH]c(=O)c1C(F)(F)F
InChI Key InChIKey=QMGKNRKUKHMXTP-UHFFFAOYSA-N
Data  3 IC50
  Tab Delimited (TSV)   2D SDfile   Computed 3D by Vconf -m prep SDfile
Find this compound or compounds like it in BindingDB:
Activity Spreadsheet -- Enzyme Inhibition Constant Data from BindingDB
Found 3 hits for monomerid = 431032
TargetProtein mono-ADP-ribosyltransferase TIPARP(Human)
Ribon Therapeutics
US Patent
LigandPNGBDBM431032(5-[5-fluoro-6-(piperidin-4-ylmethoxy)-2,3-dihydro-...)
Affinity DataIC50: <100nM. Assay description: Displacement of Probe A, a biotinylated probe binding to the TIPARP active site, was measured using a time-resolved fluorescence energy transfer (TR-...
Ligand InfoPC cidPC sid
In DepthDetails US Patent
TargetProtein mono-ADP-ribosyltransferase TIPARP(Human)
Ribon Therapeutics
US Patent
LigandPNGBDBM431032(5-[5-fluoro-6-(piperidin-4-ylmethoxy)-2,3-dihydro-...)
Affinity DataIC50: <100nM. Assay description: Displacement of Probe A, a biotinylated probe binding to the TIPARP active site, was measured using a time-resolved fluorescence energy transfer (TR-...
Ligand InfoPC cidPC sid
In DepthDetails US Patent
TargetProtein mono-ADP-ribosyltransferase TIPARP(Human)
Ribon Therapeutics
US Patent
LigandPNGBDBM431032(5-[5-fluoro-6-(piperidin-4-ylmethoxy)-2,3-dihydro-...)
Affinity DataIC50: <100nM. Assay description: Displacement of Probe A, a biotinylated probe binding to the TIPARP active site, was measured using a time-resolved fluorescence energy transfer (TR-...
Ligand InfoPC cidPC sid
In DepthDetails US Patent