BDBM43118 3-[2-[(2,2-diphenylpropanoylamino)methyl]oxazol-5-yl]indole-1-carboxylic acid ethyl ester::3-[2-[[(1-oxo-2,2-diphenylpropyl)amino]methyl]-5-oxazolyl]-1-indolecarboxylic acid ethyl ester::MLS000563630::SMR000388883::cid_5461476::ethyl 3-[2-[(2,2-diphenylpropanoylamino)methyl]-1,3-oxazol-5-yl]indole-1-carboxylate
SMILES CCOC(=O)n1cc(-c2cnc(CNC(=O)C(C)(c3ccccc3)c3ccccc3)o2)c2ccccc12
InChI Key InChIKey=BYVINHSPJLKANF-UHFFFAOYSA-N
Data  3 EC50
  Tab Delimited (TSV)   2D SDfile   Computed 3D by Vconf -m prep SDfile
Find this compound or compounds like it in BindingDB:
Activity Spreadsheet -- Enzyme Inhibition Constant Data from BindingDB
Found 3 hits for monomerid = 43118
TargetNuclear receptor coactivator 2(Homo sapiens (Human))
The Scripps Research Institute Molecular Screening Center
Curated by PubChem BioAssay
LigandPNGBDBM43118(3-[2-[(2,2-diphenylpropanoylamino)methyl]oxazol-5-...)
Affinity DataEC50: >7.94E+4nM. Assay description: Source (MLSCN Center Name): The Scripps Research Institute Molecular Screening Center Center Affiliation: The Scripps Research Institute (TSRI) Assay...
Ligand InfoPC cidPC sid
In DepthDetails PCBioAssay
TargetNuclear receptor coactivator 3(Homo sapiens (Human))
The Scripps Research Institute Molecular Screening Center
Curated by PubChem BioAssay
LigandPNGBDBM43118(3-[2-[(2,2-diphenylpropanoylamino)methyl]oxazol-5-...)
Affinity DataEC50: >7.94E+4nM. Assay description: Source (MLSCN Center Name): The Scripps Research Institute Molecular Screening Center http://molscreen.florida.scripps.edu/ Center Affiliation: The ...
Ligand InfoPC cidPC sid
In DepthDetails PCBioAssay
TargetNuclear receptor coactivator 1(Homo sapiens (Human))
The Scripps Research Institute Molecular Screening Center
Curated by PubChem BioAssay
LigandPNGBDBM43118(3-[2-[(2,2-diphenylpropanoylamino)methyl]oxazol-5-...)
Affinity DataEC50: >7.94E+4nM. Assay description: Source (MLSCN Center Name): The Scripps Research Institute Molecular Screening Center Center Affiliation: The Scripps Research Institute (TSRI) Assay...
Ligand InfoPC cidPC sid
In DepthDetails PCBioAssay