BDBM43142 (2E,4E)-2-[(4-butoxybenzoyl)amino]-5-phenyl-penta-2,4-dienoic acid::(2E,4E)-2-[(4-butoxybenzoyl)amino]-5-phenylpenta-2,4-dienoic acid::(2E,4E)-2-[(4-butoxyphenyl)carbonylamino]-5-phenyl-penta-2,4-dienoic acid::(2E,4E)-2-[[(4-butoxyphenyl)-oxomethyl]amino]-5-phenylpenta-2,4-dienoic acid::2-[(4-butoxybenzoyl)amino]-5-phenyl-2,4-pentadienoic acid::MLS000689948::SMR000298669::cid_2247975
SMILES CCCCOc1ccc(cc1)C(=O)N\C(=C\C=C\c1ccccc1)C(O)=O
InChI Key InChIKey=LTWRZOGKHUBBHG-OZNFINNBSA-N
Data  3 EC50
  Tab Delimited (TSV)   2D SDfile   Computed 3D by Vconf -m prep SDfile
Find this compound or compounds like it in BindingDB:
Activity Spreadsheet -- Enzyme Inhibition Constant Data from BindingDB
Found 3 hits for monomerid = 43142
TargetNuclear receptor coactivator 2(Homo sapiens (Human))
The Scripps Research Institute Molecular Screening Center
Curated by PubChem BioAssay
LigandPNGBDBM43142((2E,4E)-2-[(4-butoxybenzoyl)amino]-5-phenyl-penta-...)
Affinity DataEC50: >7.94E+4nM. Assay description: Source (MLSCN Center Name): The Scripps Research Institute Molecular Screening Center Center Affiliation: The Scripps Research Institute (TSRI) Assay...
In DepthDetails PCBioAssay
TargetNuclear receptor coactivator 3(Homo sapiens (Human))
The Scripps Research Institute Molecular Screening Center
Curated by PubChem BioAssay
LigandPNGBDBM43142((2E,4E)-2-[(4-butoxybenzoyl)amino]-5-phenyl-penta-...)
Affinity DataEC50: >7.94E+4nM. Assay description: Source (MLSCN Center Name): The Scripps Research Institute Molecular Screening Center http://molscreen.florida.scripps.edu/ Center Affiliation: The ...
In DepthDetails PCBioAssay
TargetNuclear receptor coactivator 1(Homo sapiens (Human))
The Scripps Research Institute Molecular Screening Center
Curated by PubChem BioAssay
LigandPNGBDBM43142((2E,4E)-2-[(4-butoxybenzoyl)amino]-5-phenyl-penta-...)
Affinity DataEC50: >7.94E+4nM. Assay description: Source (MLSCN Center Name): The Scripps Research Institute Molecular Screening Center Center Affiliation: The Scripps Research Institute (TSRI) Assay...
In DepthDetails PCBioAssay