BDBM43204 1-(2-cyano-4,5-dimethoxy-phenyl)-3-(2-methoxyethyl)thiourea::1-(2-cyano-4,5-dimethoxyphenyl)-3-(2-methoxyethyl)thiourea::MLS000764223::N-(2-cyano-4,5-dimethoxyphenyl)-N'-(2-methoxyethyl)thiourea::SMR000335052::cid_3816273
SMILES COCCNC(=S)Nc1cc(OC)c(OC)cc1C#N
InChI Key InChIKey=BEONDPZRVGHOIJ-UHFFFAOYSA-N
Data  3 EC50
  Tab Delimited (TSV)   2D SDfile   Computed 3D by Vconf -m prep SDfile
Find this compound or compounds like it in BindingDB:
Activity Spreadsheet -- Enzyme Inhibition Constant Data from BindingDB
Found 3 hits for monomerid = 43204
TargetBcl-2-like protein 2(Homo sapiens (Human))
Nmmlsc
Curated by PubChem BioAssay
LigandPNGBDBM43204(1-(2-cyano-4,5-dimethoxy-phenyl)-3-(2-methoxyethyl...)
Affinity DataEC50:  1.46E+4nM. Assay description: University of New Mexico Assay Overview: Assay Support: NIH 1X01 MH079850-01 HTS to identify small molecule regulators of Bcl-2 family protein int...
In DepthDetails PCBioAssay
TargetGlutathione S-transferase Mu 1(Homo sapiens (Human))
Nmmlsc
Curated by PubChem BioAssay
LigandPNGBDBM43204(1-(2-cyano-4,5-dimethoxy-phenyl)-3-(2-methoxyethyl...)
Affinity DataEC50:  4.90E+3nM. Assay description: University of New Mexico Assay Overview: Assay Support: NIH I RO3 MH081231-01 HTS to identify specific small molecule inhibitors of Ras and Ras-re...
In DepthDetails PCBioAssay
LigandPNGBDBM43204(1-(2-cyano-4,5-dimethoxy-phenyl)-3-(2-methoxyethyl...)
Affinity DataEC50:  7.11E+3nM. Assay description: University of New Mexico Assay Overview: Assay Support: NIH 1X01 MH079850-01 HTS to identify small molecule regulators of Bcl-2 family protein int...
In DepthDetails PCBioAssay