BDBM43236 2-(4-chlorophenyl)sulfanylquinoline-4-carboxylic acid::2-[(4-chlorophenyl)thio]-4-quinolinecarboxylic acid::2-[(4-chlorophenyl)thio]cinchoninic acid::UNM000011083801::cid_4550953
SMILES OC(=O)c1cc(Sc2ccc(Cl)cc2)nc2ccccc12
InChI Key InChIKey=WNLHYWCEACLWHS-UHFFFAOYSA-N
Data  2 EC50
  Tab Delimited (TSV)   2D SDfile   Computed 3D by Vconf -m prep SDfile
Find this compound or compounds like it in BindingDB:
Activity Spreadsheet -- Enzyme Inhibition Constant Data from BindingDB
Found 2 hits for monomerid = 43236
LigandPNGBDBM43236(2-(4-chlorophenyl)sulfanylquinoline-4-carboxylic a...)
Affinity DataEC50:  6.94E+4nM. Assay description: University of New Mexico Assay Overview: Assay Support: NIH I RO3 MH081231-01 HTS to identify specific small molecule inhibitors of Ras and Ras-rela...
In DepthDetails PCBioAssay
TargetCell division control protein 42 homolog(Homo sapiens (Human))
Nmmlsc
Curated by PubChem BioAssay
LigandPNGBDBM43236(2-(4-chlorophenyl)sulfanylquinoline-4-carboxylic a...)
Affinity DataEC50:  1.87E+4nM. Assay description: University of New Mexico Assay Overview: Assay Support: NIH I RO3 MH081231-01 HTS to identify specific small molecule inhibitors of Ras and Ras-rela...
In DepthDetails PCBioAssay