BDBM43267 3,5-Dihydroxy-benzoic acid (4-methylsulfanyl-benzylidene)-hydrazide::3,5-dihydroxy-N-[(4-methylsulfanylphenyl)methylideneamino]benzamide::3,5-dihydroxy-N-[[4-(methylthio)benzylidene]amino]benzamide::3,5-dihydroxy-N-[[4-(methylthio)phenyl]methylideneamino]benzamide::MLS000553612::N-[(4-methylsulfanylphenyl)methylideneamino]-3,5-bis(oxidanyl)benzamide::SMR000171545::cid_769767
SMILES CSc1ccc(C=NNC(=O)c2cc(O)cc(O)c2)cc1
InChI Key InChIKey=MIPUOSSEGDRLCV-UHFFFAOYSA-N
Data  1 EC50
  Tab Delimited (TSV)   2D SDfile   Computed 3D by Vconf -m prep SDfile
Find this compound or compounds like it in BindingDB:
Activity Spreadsheet -- Enzyme Inhibition Constant Data from BindingDB
Found 1 hit for monomerid = 43267
LigandPNGBDBM43267(3,5-Dihydroxy-benzoic acid (4-methylsulfanyl-benzy...)
Affinity DataEC50:  5.54E+4nM. Assay description: University of New Mexico Assay Overview: Assay Support: NIH I RO3 MH081231-01 HTS to identify specific small molecule inhibitors of Ras and Ras-rela...
In DepthDetails PCBioAssay