BDBM43290 2-methyl-1-[2-(2-methylphenoxy)ethyl]-3-indolecarboxylic acid::2-methyl-1-[2-(2-methylphenoxy)ethyl]indole-3-carboxylic acid::UNM000011091601::cid_25109974
SMILES Cc1c(C(O)=O)c2ccccc2n1CCOc1ccccc1C
InChI Key InChIKey=ATCUYGRIDCJKIK-UHFFFAOYSA-N
Data  1 EC50
  Tab Delimited (TSV)   2D SDfile   Computed 3D by Vconf -m prep SDfile
Find this compound or compounds like it in BindingDB:
Activity Spreadsheet -- Enzyme Inhibition Constant Data from BindingDB
Found 1 hit for monomerid = 43290
LigandPNGBDBM43290(2-methyl-1-[2-(2-methylphenoxy)ethyl]-3-indolecarb...)
Affinity DataEC50:  625nM. Assay description: University of New Mexico Assay Overview: Assay Support: NIH I RO3 MH081231-01 HTS to identify specific small molecule inhibitors of Ras and Ras-rela...
In DepthDetails PCBioAssay