BDBM43319 3,4-dimethoxy-N-(4-oxidanylnaphthalen-1-yl)benzamide::N-(4-hydroxy-1-naphthalenyl)-3,4-dimethoxybenzamide::N-(4-hydroxy-1-naphthyl)-3,4-dimethoxy-benzamide::N-(4-hydroxynaphthalen-1-yl)-3,4-dimethoxybenzamide::PC-0626764::PCMD-CC-JBS-230::cid_16738595
SMILES COc1ccc(cc1OC)C(=O)Nc1ccc(O)c2ccccc12
InChI Key InChIKey=MPFVGCKCDAPQGP-UHFFFAOYSA-N
Data  1 IC50
  Tab Delimited (TSV)   2D SDfile   Computed 3D by Vconf -m prep SDfile
Find this compound or compounds like it in BindingDB:
Activity Spreadsheet -- Enzyme Inhibition Constant Data from BindingDB
Found 1 hit for monomerid = 43319
TargetDNA-directed RNA polymerase subunit beta(Escherichia coli)
Pcmd
Curated by PubChem BioAssay
LigandPNGBDBM43319(3,4-dimethoxy-N-(4-oxidanylnaphthalen-1-yl)benzami...)
Affinity DataIC50: >5.00E+4nM. Assay description: Screening Center: Penn Center for Molecular Discovery Center Affiliation: University of Pennsylvania Network: Molecular Library Screening Center Netw...
In DepthDetails PCBioAssay