BDBM43331 1-(2-hydroxy-1-naphthalenyl)-3-phenylurea::1-(2-hydroxy-1-naphthyl)-3-phenyl-urea::1-(2-hydroxynaphthalen-1-yl)-3-phenylurea::1-(2-oxidanylnaphthalen-1-yl)-3-phenyl-urea::PC-0626776::PCMD-CC-PAB-242::cid_16738606
SMILES Oc1ccc2ccccc2c1NC(=O)Nc1ccccc1
InChI Key InChIKey=PWJGRPGHPLKMJA-UHFFFAOYSA-N
Data  1 IC50
  Tab Delimited (TSV)   2D SDfile   Computed 3D by Vconf -m prep SDfile
Find this compound or compounds like it in BindingDB:
Activity Spreadsheet -- Enzyme Inhibition Constant Data from BindingDB
Found 1 hit for monomerid = 43331
TargetDNA-directed RNA polymerase subunit beta(Escherichia coli)
Pcmd
Curated by PubChem BioAssay
LigandPNGBDBM43331(1-(2-hydroxy-1-naphthalenyl)-3-phenylurea | 1-(2-h...)
Affinity DataIC50: >5.00E+4nM. Assay description: Screening Center: Penn Center for Molecular Discovery Center Affiliation: University of Pennsylvania Network: Molecular Library Screening Center Netw...
In DepthDetails PCBioAssay