BDBM43349 4-[(3,5-dimethyl-1,2-oxazol-4-yl)methoxy]-N-(pyridin-2-ylmethyl)benzamide::4-[(3,5-dimethyl-4-isoxazolyl)methoxy]-N-(2-pyridinylmethyl)benzamide::4-[(3,5-dimethylisoxazol-4-yl)methoxy]-N-(2-pyridylmethyl)benzamide::MLS000056151::SMR000067964::cid_2495025
SMILES Cc1noc(C)c1COc1ccc(cc1)C(=O)NCc1ccccn1
InChI Key InChIKey=MFVSGCDPMIOOIT-UHFFFAOYSA-N
Data  1 IC50  1 EC50
  Tab Delimited (TSV)   2D SDfile   Computed 3D by Vconf -m prep SDfile
Find this compound or compounds like it in BindingDB:
Activity Spreadsheet -- Enzyme Inhibition Constant Data from BindingDB
Found 2 hits for monomerid = 43349
TargetKallikrein-5(Homo sapiens (Human))
Pcmd
Curated by PubChem BioAssay
LigandPNGBDBM43349(4-[(3,5-dimethyl-1,2-oxazol-4-yl)methoxy]-N-(pyrid...)
Affinity DataIC50:  5.00E+4nM. Assay description: Molecular Library Screening Center Network (MLSCN) Penn Center for Molecular Discovery (PCMD) Assay Provider: Scott L. Diamond, University of Pennsy...
In DepthDetails PCBioAssay
TargetE3 ubiquitin-protein ligase Mdm2(Homo sapiens (Human))
Pcmd
Curated by PubChem BioAssay
LigandPNGBDBM43349(4-[(3,5-dimethyl-1,2-oxazol-4-yl)methoxy]-N-(pyrid...)
Affinity DataEC50:  2.96E+3nM. Assay description: Molecular Library Screening Center Network (MLSCN) Penn Center for Molecular Discovery (PCMD) Assay Provider: Brent Stockwell, Columbia University ML...
In DepthDetails PCBioAssay