BDBM43361 1-[4-[3-(1-benzotriazolyl)-2-hydroxypropoxy]phenyl]ethanone::1-[4-[3-(benzotriazol-1-yl)-2-hydroxy-propoxy]phenyl]ethanone::1-[4-[3-(benzotriazol-1-yl)-2-hydroxypropoxy]phenyl]ethanone::1-[4-[3-(benzotriazol-1-yl)-2-oxidanyl-propoxy]phenyl]ethanone::MLS000112794::SMR000108703::cid_2917526
SMILES CC(=O)c1ccc(OCC(O)Cn2nnc3ccccc23)cc1
InChI Key InChIKey=LUYKGTSKGPXRPZ-UHFFFAOYSA-N
Data  1 EC50
  Tab Delimited (TSV)   2D SDfile   Computed 3D by Vconf -m prep SDfile
Find this compound or compounds like it in BindingDB:
Activity Spreadsheet -- Enzyme Inhibition Constant Data from BindingDB
Found 1 hit for monomerid = 43361
TargetE3 ubiquitin-protein ligase Mdm2(Homo sapiens (Human))
Pcmd
Curated by PubChem BioAssay
LigandPNGBDBM43361(1-[4-[3-(1-benzotriazolyl)-2-hydroxypropoxy]phenyl...)
Affinity DataEC50:  1.27E+4nM. Assay description: Molecular Library Screening Center Network (MLSCN) Penn Center for Molecular Discovery (PCMD) Assay Provider: Brent Stockwell, Columbia University ML...
In DepthDetails PCBioAssay