BDBM43369 2-chloro-4,5-difluoro-benzoic acid (3-besyl-4,6-dimethyl-2-pyridyl) ester::2-chloro-4,5-difluorobenzoic acid [3-(benzenesulfonyl)-4,6-dimethyl-2-pyridinyl] ester::4,6-dimethyl-3-(phenylsulfonyl)-2-pyridinyl 2-chloro-4,5-difluorobenzenecarboxylate::MLS000541479::SMR000126337::[3-(benzenesulfonyl)-4,6-dimethylpyridin-2-yl] 2-chloro-4,5-difluorobenzoate::[4,6-dimethyl-3-(phenylsulfonyl)pyridin-2-yl] 2-chloranyl-4,5-bis(fluoranyl)benzoate::cid_1478960
SMILES Cc1cc(C)c(c(OC(=O)c2cc(F)c(F)cc2Cl)n1)S(=O)(=O)c1ccccc1
InChI Key InChIKey=OUADNAYNVDLFHV-UHFFFAOYSA-N
Data  3 IC50  1 EC50
  Tab Delimited (TSV)   2D SDfile   Computed 3D by Vconf -m prep SDfile
Find this compound or compounds like it in BindingDB:
Activity Spreadsheet -- Enzyme Inhibition Constant Data from BindingDB
Found 4 hits for monomerid = 43369
TargetE3 ubiquitin-protein ligase Mdm2(Homo sapiens (Human))
Pcmd
Curated by PubChem BioAssay
LigandPNGBDBM43369(2-chloro-4,5-difluoro-benzoic acid (3-besyl-4,6-di...)
Affinity DataEC50:  1.86E+5nM. Assay description: Molecular Library Screening Center Network (MLSCN) Penn Center for Molecular Discovery (PCMD) Assay Provider: Brent Stockwell, Columbia University ML...
In DepthDetails PCBioAssay
TargetDNA damage-inducible transcript 3 protein(Mus musculus)
Emory University
Curated by PubChem BioAssay
LigandPNGBDBM43369(2-chloro-4,5-difluoro-benzoic acid (3-besyl-4,6-di...)
Affinity DataIC50: >1.00E+4nM. Assay description: NIH Molecular Libraries Screening Centers Network [MLSCN] Emory Chemical Biology Discovery Center in MLSCN Assay provider: Dr. Randal Kaufman, Univer...
In DepthDetails PCBioAssay
TargetX-box-binding protein 1(Homo sapiens (Human))
Emory University
Curated by PubChem BioAssay
LigandPNGBDBM43369(2-chloro-4,5-difluoro-benzoic acid (3-besyl-4,6-di...)
Affinity DataIC50:  1.00E+4nM. Assay description: NIH Molecular Libraries Screening Centers Network [MLSCN] Emory Chemical Biology Discovery Center in MLSCN Assay provider: Dr. Randal Kaufman, Univer...
In DepthDetails PCBioAssay
TargetDNA damage-inducible transcript 3 protein(Mus musculus)
Emory University
Curated by PubChem BioAssay
LigandPNGBDBM43369(2-chloro-4,5-difluoro-benzoic acid (3-besyl-4,6-di...)
Affinity DataIC50: >1.00E+4nM. Assay description: NIH Molecular Libraries Screening Centers Network [MLSCN] Emory Chemical Biology Discovery Center in MLSCN Assay provider: Dr. Randal Kaufman, Univer...
In DepthDetails PCBioAssay