BDBM43402 4-(3,5-dimethyl-4-nitro-1-pyrazolyl)-N-(phenylmethyl)butanamide::4-(3,5-dimethyl-4-nitro-pyrazol-1-yl)-N-(phenylmethyl)butanamide::MLS000580674::N-benzyl-4-(3,5-dimethyl-4-nitro-1H-pyrazol-1-yl)butanamide::N-benzyl-4-(3,5-dimethyl-4-nitro-pyrazol-1-yl)butyramide::N-benzyl-4-(3,5-dimethyl-4-nitropyrazol-1-yl)butanamide::SMR000204837::cid_757109
SMILES Cc1nn(CCCC(=O)NCc2ccccc2)c(C)c1[N+]([O-])=O
InChI Key InChIKey=PBGBWPMRRHXGGR-UHFFFAOYSA-N
Data  1 EC50
  Tab Delimited (TSV)   2D SDfile   Computed 3D by Vconf -m prep SDfile
Find this compound or compounds like it in BindingDB:
Activity Spreadsheet -- Enzyme Inhibition Constant Data from BindingDB
Found 1 hit for monomerid = 43402
TargetE3 ubiquitin-protein ligase Mdm2(Homo sapiens (Human))
Pcmd
Curated by PubChem BioAssay
LigandPNGBDBM43402(4-(3,5-dimethyl-4-nitro-1-pyrazolyl)-N-(phenylmeth...)
Affinity DataEC50:  9.49E+7nM. Assay description: Molecular Library Screening Center Network (MLSCN) Penn Center for Molecular Discovery (PCMD) Assay Provider: Brent Stockwell, Columbia University ML...
In DepthDetails PCBioAssay