BDBM43417 3-[allyl-[3-(trifluoromethyl)phenyl]sulfamoyl]benzoic acid [2-keto-2-(propylamino)ethyl] ester::3-[prop-2-enyl-[3-(trifluoromethyl)phenyl]sulfamoyl]benzoic acid [2-oxo-2-(propylamino)ethyl] ester::MLS000374725::SMR000242142::[2-oxidanylidene-2-(propylamino)ethyl] 3-[prop-2-enyl-[3-(trifluoromethyl)phenyl]sulfamoyl]benzoate::[2-oxo-2-(propylamino)ethyl] 3-[prop-2-enyl-[3-(trifluoromethyl)phenyl]sulfamoyl]benzoate::cid_4370317
SMILES CCCNC(=O)COC(=O)c1cccc(c1)S(=O)(=O)N(CC=C)c1cccc(c1)C(F)(F)F
InChI Key InChIKey=DIQNZGBWAVZDFM-UHFFFAOYSA-N
Data  1 EC50
  Tab Delimited (TSV)   2D SDfile   Computed 3D by Vconf -m prep SDfile
Find this compound or compounds like it in BindingDB:
Activity Spreadsheet -- Enzyme Inhibition Constant Data from BindingDB
Found 1 hit for monomerid = 43417
TargetE3 ubiquitin-protein ligase Mdm2(Homo sapiens (Human))
Pcmd
Curated by PubChem BioAssay
LigandPNGBDBM43417(3-[allyl-[3-(trifluoromethyl)phenyl]sulfamoyl]benz...)
Affinity DataEC50:  2.77E+5nM. Assay description: Molecular Library Screening Center Network (MLSCN) Penn Center for Molecular Discovery (PCMD) Assay Provider: Brent Stockwell, Columbia University ML...
In DepthDetails PCBioAssay