BDBM43424 2-[4,5-bis(chloranyl)-6-oxidanylidene-pyridazin-1-yl]-N-(cyclohexylmethyl)ethanamide::MLS000390353::N-(cyclohexylmethyl)-2-(4,5-dichloro-6-keto-pyridazin-1-yl)acetamide::N-(cyclohexylmethyl)-2-(4,5-dichloro-6-oxo-1-pyridazinyl)acetamide::N-(cyclohexylmethyl)-2-(4,5-dichloro-6-oxopyridazin-1-yl)acetamide::SMR000255320::cid_2585197
SMILES Clc1cnn(CC(=O)NCC2CCCCC2)c(=O)c1Cl
InChI Key InChIKey=VJTYXYHEDHOHEI-UHFFFAOYSA-N
Data  2 IC50  4 EC50
  Tab Delimited (TSV)   2D SDfile   Computed 3D by Vconf -m prep SDfile
Find this compound or compounds like it in BindingDB:
Activity Spreadsheet -- Enzyme Inhibition Constant Data from BindingDB
Found 6 hits for monomerid = 43424
TargetE3 ubiquitin-protein ligase Mdm2(Homo sapiens (Human))
Pcmd
Curated by PubChem BioAssay
LigandPNGBDBM43424(2-[4,5-bis(chloranyl)-6-oxidanylidene-pyridazin-1-...)
Affinity DataEC50:  1.89E+3nM. Assay description: Molecular Library Screening Center Network (MLSCN) Penn Center for Molecular Discovery (PCMD) Assay Provider: Brent Stockwell, Columbia University ML...
In DepthDetails PCBioAssay
TargetE3 ubiquitin-protein ligase Mdm2(Homo sapiens (Human))
Pcmd
Curated by PubChem BioAssay
LigandPNGBDBM43424(2-[4,5-bis(chloranyl)-6-oxidanylidene-pyridazin-1-...)
Affinity DataEC50:  2.08E+3nM. Assay description: Molecular Library Screening Center Network (MLSCN) Penn Center for Molecular Discovery (PCMD) Assay Provider: Brent Stockwell, Columbia University ML...
In DepthDetails PCBioAssay
TargetReceptor-interacting serine/threonine-protein kinase 2(Homo sapiens (Human))
The Scripps Research Institute Molecular Screening Center
Curated by PubChem BioAssay
LigandPNGBDBM43424(2-[4,5-bis(chloranyl)-6-oxidanylidene-pyridazin-1-...)
Affinity DataIC50:  3.98E+3nM
In DepthDetails PCBioAssay
TargetBcl-2-like protein 11(Homo sapiens (Human))
Broad Institute
Curated by PubChem BioAssay
LigandPNGBDBM43424(2-[4,5-bis(chloranyl)-6-oxidanylidene-pyridazin-1-...)
Affinity DataEC50: >3.50E+5nM. Assay description: Keywords: apoptosis, BH3 domain, Bcl2-A1, BIM, caspase, cancer Primary Collaborator: Todd Golub, Broad Institute, golub@broadinstitute.org Assay Over...
In DepthDetails PCBioAssay
TargetBeta-lactamase(Pseudomonas aeruginosa)
The Scripps Research Institute Molecular Screening Center
Curated by PubChem BioAssay
LigandPNGBDBM43424(2-[4,5-bis(chloranyl)-6-oxidanylidene-pyridazin-1-...)
Affinity DataIC50: >4.98E+4nM
In DepthDetails PCBioAssay
TargetE3 ubiquitin-protein ligase Mdm2(Homo sapiens (Human))
Pcmd
Curated by PubChem BioAssay
LigandPNGBDBM43424(2-[4,5-bis(chloranyl)-6-oxidanylidene-pyridazin-1-...)
Affinity DataEC50:  4.05E+3nM. Assay description: Molecular Library Screening Center Network (MLSCN) Penn Center for Molecular Discovery (PCMD) Assay Provider: Brent Stockwell, Columbia University ML...
In DepthDetails PCBioAssay