BDBM43443 5-N-(isoquinolin-5-ylmethyl)-6-N-(2-methoxyethyl)-5-N-methyl-[1,2,5]oxadiazolo[3,4-b]pyrazine-5,6-diamine::5-isoquinolylmethyl-[6-(2-methoxyethylamino)furazano[3,4-b]pyrazin-5-yl]-methyl-amine::MLS000732946::N-(isoquinolin-5-ylmethyl)-N'-(2-methoxyethyl)-N-methyl[1,2,5]oxadiazolo[3,4-b]pyrazine-5,6-diamine::N5-(5-isoquinolinylmethyl)-N6-(2-methoxyethyl)-N5-methyl-[1,2,5]oxadiazolo[3,4-b]pyrazine-5,6-diamine::N5-(isoquinolin-5-ylmethyl)-N6-(2-methoxyethyl)-N5-methyl-[1,2,5]oxadiazolo[3,4-b]pyrazine-5,6-diamine::SMR000317916::cid_16188697
SMILES COCCNc1nc2nonc2nc1N(C)Cc1cccc2cnccc12
InChI Key InChIKey=PKZLYTVWXWLJMD-UHFFFAOYSA-N
Data  1 EC50
  Tab Delimited (TSV)   2D SDfile   Computed 3D by Vconf -m prep SDfile
Find this compound or compounds like it in BindingDB:
Activity Spreadsheet -- Enzyme Inhibition Constant Data from BindingDB
Found 1 hit for monomerid = 43443
TargetE3 ubiquitin-protein ligase Mdm2(Homo sapiens (Human))
Pcmd
Curated by PubChem BioAssay
LigandPNGBDBM43443(5-N-(isoquinolin-5-ylmethyl)-6-N-(2-methoxyethyl)-...)
Affinity DataEC50:  220nM. Assay description: Molecular Library Screening Center Network (MLSCN) Penn Center for Molecular Discovery (PCMD) Assay Provider: Brent Stockwell, Columbia University ML...
Ligand InfoPC cidPC sid
In DepthDetails PCBioAssay