BDBM43482 Helenalin acetate::MLS000728543::SMR000445656::[(3aR,5R,5aR,8aR,9S,9aR)-5,8a-dimethyl-1-methylidene-2,8-bis(oxidanylidene)-3a,4,5,5a,9,9a-hexahydroazuleno[6,5-b]furan-9-yl] ethanoate::[(3aR,5R,5aR,8aR,9S,9aR)-5,8a-dimethyl-1-methylidene-2,8-dioxo-3a,4,5,5a,9,9a-hexahydroazuleno[6,5-b]furan-9-yl] acetate::acetic acid [(3aR,5R,5aR,8aR,9S,9aR)-2,8-diketo-5,8a-dimethyl-1-methylene-3a,4,5,5a,9,9a-hexahydroazuleno[6,5-b]furan-9-yl] ester::acetic acid [(3aR,5R,5aR,8aR,9S,9aR)-5,8a-dimethyl-1-methylene-2,8-dioxo-3a,4,5,5a,9,9a-hexahydroazuleno[6,5-b]furan-9-yl] ester::cid_442142
SMILES C[C@@H]1C[C@H]2OC(=O)C(=C)[C@H]2[C@H](OC(C)=O)[C@@]2(C)[C@H]1C=CC2=O
InChI Key InChIKey=DCNRYQODUSSOKC-HKHYKUHTSA-N
Data  8 IC50  2 EC50
  Tab Delimited (TSV)   2D SDfile   Computed 3D by Vconf -m prep SDfile
Find this compound or compounds like it in BindingDB:
Activity Spreadsheet -- Enzyme Inhibition Constant Data from BindingDB
Found 10 hits for monomerid = 43482
TargetE3 ubiquitin-protein ligase Mdm2(Homo sapiens (Human))
Pcmd
Curated by PubChem BioAssay
LigandPNGBDBM43482(Helenalin acetate | MLS000728543 | SMR000445656 | ...)
Affinity DataEC50:  7.68E+3nM. Assay description: Molecular Library Screening Center Network (MLSCN) Penn Center for Molecular Discovery (PCMD) Assay Provider: Brent Stockwell, Columbia University ML...
In DepthDetails PCBioAssay
TargetG-protein coupled receptor 55(Homo sapiens (Human))
Burnham Center For Chemical Genomics
Curated by PubChem BioAssay
LigandPNGBDBM43482(Helenalin acetate | MLS000728543 | SMR000445656 | ...)
Affinity DataIC50:  4.49E+3nM. Assay description: Data Source: Sanford-Burnham Center for Chemical Genomics (SBCCG) Source Affiliation: Sanford-Burnham Medical Research Institute (SBMRI, San Diego, C...
In DepthDetails PCBioAssay
TargetBcl-2-like protein 11(Homo sapiens (Human))
Broad Institute
Curated by PubChem BioAssay
LigandPNGBDBM43482(Helenalin acetate | MLS000728543 | SMR000445656 | ...)
Affinity DataEC50: >3.50E+5nM. Assay description: Keywords: apoptosis, BH3 domain, Bcl2-A1, BIM, caspase, cancer Primary Collaborator: Todd Golub, Broad Institute, golub@broadinstitute.org Assay Over...
In DepthDetails PCBioAssay
TargetDNA damage-inducible transcript 3 protein(Mus musculus)
Emory University
Curated by PubChem BioAssay
LigandPNGBDBM43482(Helenalin acetate | MLS000728543 | SMR000445656 | ...)
Affinity DataIC50:  2.36E+3nM. Assay description: NIH Molecular Libraries Screening Centers Network [MLSCN] Emory Chemical Biology Discovery Center in MLSCN Assay provider: Dr. Randal Kaufman, Univer...
In DepthDetails PCBioAssay
TargetTranscriptional activator Myb(Gallus gallus)
University Of M£Nster
Curated by ChEMBL
LigandPNGBDBM43482(Helenalin acetate | MLS000728543 | SMR000445656 | ...)
Affinity DataIC50:  710nM. Assay description: Inhibition of c-Myb-induced mim-1 gene expression in doxycyclin-treated chicken HD11 cells after 24 hrs by GFP assay
In DepthDetails ArticlePubMed
TargetType-1 angiotensin II receptor(Homo sapiens (Human))
Burnham Center For Chemical Genomics
Curated by PubChem BioAssay
LigandPNGBDBM43482(Helenalin acetate | MLS000728543 | SMR000445656 | ...)
Affinity DataIC50:  2.20E+4nM. Assay description: Data Source: Sanford-Burnham Center for Chemical Genomics (SBCCG) Source Affiliation: Sanford-Burnham Medical Research Institute(SBMRI, San Diego, C...
In DepthDetails PCBioAssay
TargetDNA damage-inducible transcript 3 protein(Mus musculus)
Emory University
Curated by PubChem BioAssay
LigandPNGBDBM43482(Helenalin acetate | MLS000728543 | SMR000445656 | ...)
Affinity DataIC50:  2.36E+3nM. Assay description: NIH Molecular Libraries Screening Centers Network [MLSCN] Emory Chemical Biology Discovery Center in MLSCN Assay provider: Dr. Randal Kaufman, Univer...
In DepthDetails PCBioAssay
TargetX-box-binding protein 1(Homo sapiens (Human))
Emory University
Curated by PubChem BioAssay
LigandPNGBDBM43482(Helenalin acetate | MLS000728543 | SMR000445656 | ...)
Affinity DataIC50:  2.15E+3nM. Assay description: NIH Molecular Libraries Screening Centers Network [MLSCN] Emory Chemical Biology Discovery Center in MLSCN Assay provider: Dr. Randal Kaufman, Univer...
In DepthDetails PCBioAssay
TargetTranscriptional activator Myb(Gallus gallus)
University Of M£Nster
Curated by ChEMBL
LigandPNGBDBM43482(Helenalin acetate | MLS000728543 | SMR000445656 | ...)
Affinity DataIC50:  706nM. Assay description: Inhibition of c-Myb-induced mim-1 gene expression in doxycyclin-treated chicken HD11 cells after 24 hrs by GFP assay
In DepthDetails ArticlePubMed
TargetApelin receptor(Homo sapiens (Human))
Sanford-Burnham Center For Chemical Genomics
Curated by PubChem BioAssay
LigandPNGBDBM43482(Helenalin acetate | MLS000728543 | SMR000445656 | ...)
Affinity DataIC50:  2.65E+4nM. Assay description: Data Source: Sanford-Burnham Center for Chemical Genomics (SBCCG) Source Affiliation: Sanford- Sanford-Burnham Medical Research Institute(SBMRI, San...
In DepthDetails PCBioAssay