BDBM43486 CMLD003472::MLS000829704::SMR000452979::cid_16759750
SMILES [H][C@@]12N(C)c3ccc(OC)cc3[C@@]11C[C@H](N=C1NC(C(=O)OC)=C2C(=O)OC)C(=O)OC
InChI Key InChIKey=YLGLBGPCVQKLMK-SAZGQGMLSA-N
Data  1 EC50
  Tab Delimited (TSV)   2D SDfile   Computed 3D by Vconf -m prep SDfile
Find this compound or compounds like it in BindingDB:
Activity Spreadsheet -- Enzyme Inhibition Constant Data from BindingDB
Found 1 hit for monomerid = 43486
TargetE3 ubiquitin-protein ligase Mdm2(Homo sapiens (Human))
Pcmd
Curated by PubChem BioAssay
LigandPNGBDBM43486(CMLD003472 | MLS000829704 | SMR000452979 | cid_167...)
Affinity DataEC50:  1.09E+3nM. Assay description: Molecular Library Screening Center Network (MLSCN) Penn Center for Molecular Discovery (PCMD) Assay Provider: Brent Stockwell, Columbia University ML...
In DepthDetails PCBioAssay