BDBM43542 MLS000760904::N-[5-(diethylsulfamoyl)-2-(4-morpholinyl)phenyl]-2-(2-pyridinyl)-4-quinolinecarboxamide::N-[5-(diethylsulfamoyl)-2-morpholin-4-yl-phenyl]-2-pyridin-2-yl-quinoline-4-carboxamide::N-[5-(diethylsulfamoyl)-2-morpholin-4-ylphenyl]-2-pyridin-2-ylquinoline-4-carboxamide::N-[5-(diethylsulfamoyl)-2-morpholino-phenyl]-2-(2-pyridyl)cinchoninamide::SMR000372215::cid_4829647
SMILES CCN(CC)S(=O)(=O)c1ccc(N2CCOCC2)c(NC(=O)c2cc(nc3ccccc23)-c2ccccn2)c1
InChI Key InChIKey=SIDMMGVBIKMQRL-UHFFFAOYSA-N
Data  2 IC50
  Tab Delimited (TSV)   2D SDfile   Computed 3D by Vconf -m prep SDfile
Find this compound or compounds like it in BindingDB:
Activity Spreadsheet -- Enzyme Inhibition Constant Data from BindingDB
Found 2 hits for monomerid = 43542
TargetSignal transducer and activator of transcription 1-alpha/beta(Homo sapiens (Human))
The Scripps Research Institute Molecular Screening Center
Curated by PubChem BioAssay
LigandPNGBDBM43542(MLS000760904 | N-[5-(diethylsulfamoyl)-2-(4-morpho...)
Affinity DataIC50:  2.12E+4nM. Assay description: Source (MLPCN Center Name): The Scripps Research Institute Molecular Screening Center Center Affiliation: The Scripps Research Institute (TSRI) Assay...
In DepthDetails PCBioAssay
TargetSignal transducer and activator of transcription 3 [702-738,740-752](Homo sapiens (Human))
The Scripps Research Institute Molecular Screening Center
Curated by PubChem BioAssay
LigandPNGBDBM43542(MLS000760904 | N-[5-(diethylsulfamoyl)-2-(4-morpho...)
Affinity DataIC50:  9.73E+3nM. Assay description: Source (MLPCN Center Name): The Scripps Research Institute Molecular Screening Center Center Affiliation: The Scripps Research Institute (TSRI) Assay...
In DepthDetails PCBioAssay